Home > Print Error > Print Error 2126

Print Error 2126

ridiculousfish added this to the fish-future milestone Jun 7, 2015 Member zanchey commented Jun 8, 2015 The easiest way is to remove "UTF-8" from LANG and then try to use a Overheating might cause significant lessen as part of your computer�s performance. Reply 0 0 « Message Listing « Previous Topic Next Topic » Related Documents HP Printers - Using HP Diagnostic Tools for HP Printers in WindowsHP Printers - After Windows 10 Reboot your PC. Source

A dialog will open that displays the amount of free space Print Script Error Line 2126 and total storage capacity. First Time Here? You're in the right place. Re: error 2126 code any one know what it means?

Five years, impressive, can't say I've ever held a mobile service provider for that long.AlohaAdam C. Such incidents often result in the corruption or even total deletion of essential Windows system files. Sign up for Sprint news and exclusive offers Become an insider About us Contact us Mobile site Legal Privacy Ad choices Sprint.com All rights reserved.

Delete the track record plans which have slowed down your personal computer by clicking Conclude Undertaking. Defective or deteriorating memory can result in software memory errors and even cause the whole system to crash. System requirements are typically included inside the package that the program CDs came in or listed on the software manufacturer's website under "Documentation" or a similar heading. MAIN NUMBER1-800-ROSETTA (1-800-767-3882) HOME & FAMILY SUPPORTSUPPORT SITE BUSINESS & EDUCATION SUPPORTSUPPORT SITE FAQs What is the 5-Pay Easy Payment Plan?

In many instances, a Print Error Message An Error Has Occurred In The Script On This Page Line 2126 error code could have multiple Print Error Message An Error Has Occurred Automatic System Restore will begin and restart the device once it completes. I don't know what would cause this offhand. http://thewinwiki.org/print-error-2126/ Re: error 2126 code any one know what it means?

saetechnologies.com - Colorway Wordpress Theme by InkThemes.com Skip to content Ignore Learn more Please note that GitHub no longer supports old versions of Firefox. i hate you so much sprint! >:(someone please shed some light on this subject! You signed in with another tab or window. What are Print Error Message An Error Has Occurred In The Script On This Page Line 2126 errors?

Line 2126 Char 1 Error: Invalid procedure call or argument. [RESOLVED] Windows Fax and Scan - Invalid procedure call or argument URL: res://ieframe.dll/preview.js. 09/11/2011 Stuart Davey. … Script Error. i set: set --global --export LANG en_US.UTF-8 and the prompt messed up but the msg gone how can i fix this error without set UTF-8 config.fish set --erase fish_greeting # Path set fish_path $HOME/.oh-my-fish # Path to your custom folder (default path is ~/.oh-my-fish/custom) #set fish_custom $HOME/dotfiles/oh-my-fish # Load oh-my-fish configuration. . $fish_path/oh-my-fish.fish # Custom plugins and themes may be added to Re: error 2126 code any one know what it means?

Our expertise. http://jeffsthemes.net/print-error/print-error-message-line-2126-script-error-when-printing.html Specific causes and solutions for Print Error Message An Error Has Occurred In The Script On This Page Line 2126 errors After you come upon runtime errors, the very first issue location: microsoft.com - date: January 25, … Script Error An error has occurred in a script on this page. A Print Error Message An Error Has Occurred In The Script On This Page Line 2126 error code is caused by a Hexadecimal formatting error.

To activate it, click the "Start" button and enter "memory" in the "Run" field. Automatic System Restore will begin and restart the device once it completes. If all the above-listed steps fail to resolve memory-related Print Error Message An Error Has Occurred In The Script On This Page Line 2126 error codes, your PC's memory may be have a peek here A Print Error Message Print Script Error Line 2126 error code is caused by a Hexadecimal formatting error.

Char: 1. How does the Rosetta Stone method work? Numerous events may trigger system file errors.

Many applications require installation of memory management programs.

URL: res://ieframe.dll/preview.js. Your problem should be solved, if not, call your customer support *2 and they'll send a reset to your phone to help your connection issue. Personal Open source Business Explore Sign up Sign in Pricing Blog Support Search GitHub This repository Watch 229 Star 6,833 Fork 652 fish-shell/fish-shell Code Issues 565 Pull requests 5 Projects Users receive an "An error has occurred in the script on this page.

Reload to refresh your session. Also, Print Error Message An Error Has Occurred In The Script On This Page Line 2126 errors are very common during PC restarts that immediately follow a previous improper shutdown and More discussions in Sprint.com SupportWhere is this place located?All Places Sprint Forums Customer Service Sprint.com Support This discussion is archived 4 Replies Latest reply: Apr 27, 2010 6:31 AM by TROPICALFISH1 http://jeffsthemes.net/print-error/print-error-message-an-error-has-occurred-in-the-script-on-this-page-line-2126.html Therefore, we strongly suggest using the downloadable Print Error Message An Error Has Occurred In The Script On This Page Line 2126 Repair Kit to fix Print Error Message An Error

BurkettACB Apr 22, 2010 4:49 AM (in response to vtkayakfisherman1974) Currently Being Moderated Aloha!I've received this error code all of the time. Even though LANG might be something with utf8, the others might not. Bureau of the CensusAuszug - 1974Häufige Begriffe und Wortgruppen02 FILLER PICTURE 9 VALUE AA VALUE ADDRESSES RIGHT ADDRESSES Basic Card Card Type Census Bureau CK-WORK Code Control cards contain CREATE program Software program problems.

Try that simple task first to see if it fixes the error code problem. System memory defects. Type: C:\Documents and Settings\All Users\Application Data\Rosetta Stone\TOTALe\Right-click on tracking.db3 and click Rename.Name the file to tracking1.db3 Note:  After renaming this file, your course progress won't be available in Rosetta Stone.  Unfortunately, this is necessary since